visit_detail_id,person_id,visit_detail_concept_id,visit_detail_start_date,visit_detail_start_datetime,visit_detail_end_date,visit_detail_end_datetime,visit_detail_type_concept_id,provider_id,care_site_id,admitting_source_concept_id,discharge_to_concept_id,preceding_visit_detail_id,visit_detail_source_value,visit_detail_source_concept_id,admitting_source_value,discharge_to_source_value,visit_detail_parent_id,visit_occurrence_id
-1757828362327778468,3129727379702505063,8870,2197-04-17,2197-04-17 09:48:00,2197-04-17,2197-04-17 11:44:19,32817,,-3633440072147213200,8870,,,10002930|25282382|38481760,2000001903,EMERGENCY ROOM,,,-9127810274408915712
-4357165027259445573,3129727379702505063,8870,2197-04-16,2197-04-16 22:57:00,2197-04-17,2197-04-17 09:48:00,32817,,6888076371289519343,8870,,,10002930|25282382|35169671,2000001901,EMERGENCY ROOM,,,-9127810274408915712
8055254568125344353,3129727379702505063,581385,2197-04-16,2197-04-16 22:57:00,2197-04-16,2197-04-16 22:57:00,32817,,,8870,,,10002930|25282382,2000001805,EMERGENCY ROOM,,,-9127810274408915712
-9202240471022785074,1741351032930224901,32037,2177-07-14,2177-07-14 20:38:00,2177-07-15,2177-07-15 16:08:36,32817,,7883369686195988084,8870,581476,-3849978153133518996,10037928|22490490|30229866,2000001622,Emergency Department,HOME HEALTH CARE,,3736965967695233281
-3849978153133518996,1741351032930224901,8870,2177-07-14,2177-07-14 14:52:00,2177-07-14,2177-07-14 20:38:00,32817,,6888076371289519343,8870,32037,,10037928|22490490|35750269,2000001901,EMERGENCY ROOM,Medical/Surgical Intensive Care Unit (MICU/SICU),,3736965967695233281
-2795818614413382168,1741351032930224901,8870,2177-07-14,2177-07-14 14:52:00,2177-07-14,2177-07-14 14:52:00,32817,,,8870,581476,,10037928|22490490,2000001806,EMERGENCY ROOM,HOME HEALTH CARE,,3736965967695233281
-3608719132053985689,1741351032930224901,38004515,2177-07-15,2177-07-15 16:08:36,2177-07-15,2177-07-15 16:11:26,32817,,-539367094141958574,8870,38004515,,10037928|22490490|39858008,2000001902,EMERGENCY ROOM,Medicine,,3736965967695233281
-710253616151009383,1741351032930224901,38004515,2177-07-15,2177-07-15 16:11:26,2177-07-24,2177-07-24 13:33:14,32817,,-539367094141958574,38004515,581476,-3608719132053985689,10037928|22490490|31802391,2000001902,Medicine,HOME HEALTH CARE,,3736965967695233281
8319792094140832103,2601314283911413076,8870,2137-10-08,2137-10-08 18:16:00,2137-10-08,2137-10-08 18:16:00,32817,,,8870,4216643,,10025463|24470193,2000001806,EMERGENCY ROOM,DIED,,3689687882644440322
2071855025416528554,2601314283911413076,8870,2137-10-08,2137-10-08 18:16:00,2137-10-08,2137-10-08 21:20:50,32817,,6888076371289519343,8870,4134563,,10025463|24470193|32657035,2000001901,EMERGENCY ROOM,PACU,,3689687882644440322
2047334362162990824,2601314283911413076,4134563,2137-10-08,2137-10-08 21:20:50,2137-10-09,2137-10-09 02:51:25,32817,,1236875180544517908,8870,4216643,2071855025416528554,10025463|24470193|30003007,2000001606,Emergency Department,DIED,,3689687882644440322
7820933347415553389,2601314283911413076,4305366,2137-10-09,2137-10-09 02:51:25,2137-10-09,2137-10-09 17:32:37,32817,,-4921759089326952807,8870,4216643,,10025463|24470193|39502772,2000001625,EMERGENCY ROOM,DIED,,3689687882644440322
7022167322575848519,579254014084392336,8870,2117-03-14,2117-03-14 15:19:00,2117-03-14,2117-03-14 16:34:58,32817,,6888076371289519343,8870,4305366,,10037861|24540843|36010992,2000001901,EMERGENCY ROOM,Neuro Surgical Intensive Care Unit (Neuro SICU),,-3332367749035126781
-1322368534035656558,579254014084392336,8870,2117-03-14,2117-03-14 15:19:00,2117-03-14,2117-03-14 15:19:00,32817,,,8870,4216643,,10037861|24540843,2000001806,EMERGENCY ROOM,DIED,,-3332367749035126781
-5179144749129840109,579254014084392336,4305366,2117-03-14,2117-03-14 17:35:24,2117-03-25,2117-03-25 02:35:08,32817,,9163527066039634598,4305366,4216643,-6962159938792300234,10037861|24540843|36309569,2000001640,Neuro Surgical Intensive Care Unit (Neuro SICU),DIED,,-3332367749035126781
-6962159938792300234,579254014084392336,4305366,2117-03-14,2117-03-14 16:34:58,2117-03-14,2117-03-14 17:35:24,32817,,9163527066039634598,8870,4305366,7022167322575848519,10037861|24540843|32401211,2000001640,Emergency Department,Neuro Surgical Intensive Care Unit (Neuro SICU),,-3332367749035126781
1941509294858582080,1194579079287927665,581383,2176-12-17,2176-12-17 01:07:00,2176-12-22,2176-12-22 16:24:33,32817,,3867689376711056927,8870,581476,,10015931|24420677|39827345,2000001905,EMERGENCY ROOM,HOME HEALTH CARE,,-4772872574388211965
-6590632138347473980,1194579079287927665,581385,2176-12-16,2176-12-16 18:24:00,2176-12-16,2176-12-16 18:24:00,32817,,,8870,581476,,10015931|24420677,2000001807,EMERGENCY ROOM,HOME HEALTH CARE,,-4772872574388211965
-2235535316584319840,1194579079287927665,8870,2176-12-16,2176-12-16 18:24:00,2176-12-17,2176-12-17 01:07:00,32817,,6888076371289519343,8870,581476,,10015931|24420677|32776970,2000001901,EMERGENCY ROOM,HOME HEALTH CARE,,-4772872574388211965
-4721041871054179209,1194579079287927665,40481392,2176-12-22,2176-12-22 16:24:33,2176-12-23,2176-12-23 20:14:53,32817,,4260571064587438420,8870,581476,,10015931|24420677|33530830,2000001619,EMERGENCY ROOM,HOME HEALTH CARE,,-4772872574388211965
-5600469951952730903,1194579079287927665,4149946,2176-12-22,2176-12-22 19:04:51,2176-12-31,2176-12-31 17:35:00,32817,,,4147091,581476,-8520707848701890823,10015931|24420677|2176-12-22 19:04:51,2000001860,MED,HOME HEALTH CARE,,-4772872574388211965
-8607524112734311584,1194579079287927665,581383,2176-12-23,2176-12-23 20:14:53,2176-12-31,2176-12-31 17:44:54,32817,,3867689376711056927,8870,581476,,10015931|24420677|33555563,2000001905,EMERGENCY ROOM,HOME HEALTH CARE,,-4772872574388211965
-8520707848701890823,1194579079287927665,4147091,2176-12-22,2176-12-22 16:24:53,2176-12-22,2176-12-22 19:04:51,32817,,,8870,4149946,,10015931|24420677|2176-12-22 16:24:53,2000001855,EMERGENCY ROOM,CMED,,-4772872574388211965
-4277380176760054840,7427037643503998178,8870,2176-08-11,2176-08-11 17:35:00,2176-08-11,2176-08-11 18:00:33,32817,,-3633440072147213200,8870,,-8887064077638154456,10012853|22896692|32862592,2000001903,Emergency Department,,,-1429392228907728892
-8887064077638154456,7427037643503998178,8870,2176-08-11,2176-08-11 08:36:00,2176-08-11,2176-08-11 17:35:00,32817,,6888076371289519343,8870,8870,,10012853|22896692|36326553,2000001901,EMERGENCY ROOM,Emergency Department Observation,,-1429392228907728892
4785834636953543497,7427037643503998178,581385,2176-08-11,2176-08-11 08:36:00,2176-08-11,2176-08-11 08:36:00,32817,,,8870,,,10012853|22896692,2000001805,EMERGENCY ROOM,,,-1429392228907728892
-3786404530704061796,2288881942133868955,38004207,2157-12-31,2157-12-31 16:00:00,2157-12-31,2157-12-31 16:00:00,32817,,,38004207,38004207,-5999961463327692978,ecgmx_039.3900001.III S AMP,2000001801,AMBULATORY OBSERVATION,AMBULATORY OBSERVATION,,2007754572128475909
-4903416864183578575,2288881942133868955,38004207,2157-12-31,2157-12-31 16:00:00,2157-12-31,2157-12-31 16:00:00,32817,,,38004207,38004207,-2408262100246197260,ecgmx_039.3900001.III QRS DUR,2000001801,AMBULATORY OBSERVATION,AMBULATORY OBSERVATION,,2007754572128475909
6616882916857721312,2288881942133868955,38004207,2157-12-31,2157-12-31 16:00:00,2157-12-31,2157-12-31 16:00:00,32817,,,38004207,38004207,-6359211678442643215,ecgmx_039.3900001.III TPOS AMP,2000001801,AMBULATORY OBSERVATION,AMBULATORY OBSERVATION,,2007754572128475909
1794857591679207507,2288881942133868955,38004207,2157-12-31,2157-12-31 16:00:00,2157-12-31,2157-12-31 16:00:00,32817,,,38004207,38004207,7989515803179936097,ecgmx_039.3900001.III STJ60,2000001801,AMBULATORY OBSERVATION,AMBULATORY OBSERVATION,,2007754572128475909
-5623290451954814457,2288881942133868955,38004207,2157-12-31,2157-12-31 16:00:00,2157-12-31,2157-12-31 16:00:00,32817,,,38004207,38004207,-6674850186216542378,ecgmx_039.3900001.III T AMP,2000001801,AMBULATORY OBSERVATION,AMBULATORY OBSERVATION,,2007754572128475909
-6674850186216542378,2288881942133868955,38004207,2157-12-31,2157-12-31 16:00:00,2157-12-31,2157-12-31 16:00:00,32817,,,38004207,38004207,6616882916857721312,ecgmx_039.3900001.III R AMP,2000001801,AMBULATORY OBSERVATION,AMBULATORY OBSERVATION,,2007754572128475909
-6359211678442643215,2288881942133868955,38004207,2157-12-31,2157-12-31 16:00:00,2157-12-31,2157-12-31 16:00:00,32817,,,38004207,38004207,2714166738054558252,ecgmx_039.3900001.III F AMP,2000001801,AMBULATORY OBSERVATION,AMBULATORY OBSERVATION,,2007754572128475909
-5999961463327692978,2288881942133868955,38004207,2157-12-31,2157-12-31 16:00:00,2157-12-31,2157-12-31 16:00:00,32817,,,38004207,38004207,1794857591679207507,ecgmx_039.3900001.GLOBAL QT,2000001801,AMBULATORY OBSERVATION,AMBULATORY OBSERVATION,,2007754572128475909
3508479982597370501,2288881942133868955,38004207,2157-12-31,2157-12-31 16:00:00,2157-12-31,2157-12-31 16:00:00,32817,,,38004207,38004207,-6887447238471001441,ecgmx_039.3900001.III STJ80,2000001801,AMBULATORY OBSERVATION,AMBULATORY OBSERVATION,,2007754572128475909
7989515803179936097,2288881942133868955,38004207,2157-12-31,2157-12-31 16:00:00,2157-12-31,2157-12-31 16:00:00,32817,,,38004207,38004207,-7089502832820166146,ecgmx_039.3900001.GLOBAL QTc,2000001801,AMBULATORY OBSERVATION,AMBULATORY OBSERVATION,,2007754572128475909
7086346580082180450,2288881942133868955,38004207,2157-12-31,2157-12-31 16:00:00,2157-12-31,2157-12-31 16:00:00,32817,,,38004207,38004207,-5623290451954814457,ecgmx_039.3900001.III I AMP,2000001801,AMBULATORY OBSERVATION,AMBULATORY OBSERVATION,,2007754572128475909
-7089502832820166146,2288881942133868955,38004207,2157-12-31,2157-12-31 16:00:00,2157-12-31,2157-12-31 16:00:00,32817,,,38004207,38004207,7086346580082180450,ecgmx_039.3900001.GLOBAL PR INT,2000001801,AMBULATORY OBSERVATION,AMBULATORY OBSERVATION,,2007754572128475909
-2408262100246197260,2288881942133868955,38004207,2157-12-31,2157-12-31 16:00:00,2157-12-31,2157-12-31 16:00:00,32817,,,38004207,38004207,3508479982597370501,ecgmx_039.3900001.GLOBAL HEART RATE,2000001801,AMBULATORY OBSERVATION,AMBULATORY OBSERVATION,,2007754572128475909
-6887447238471001441,2288881942133868955,38004207,2157-12-31,2157-12-31 16:00:00,2157-12-31,2157-12-31 16:00:00,32817,,,38004207,38004207,-2618361695610658581,ecgmx_039.3900001.GLOBAL QRS Dur,2000001801,AMBULATORY OBSERVATION,AMBULATORY OBSERVATION,,2007754572128475909
-2618361695610658581,2288881942133868955,38004207,2157-12-31,2157-12-31 16:00:00,2157-12-31,2157-12-31 16:00:00,32817,,,38004207,38004207,-3786404530704061796,ecgmx_039.3900001.III R DUR,2000001801,AMBULATORY OBSERVATION,AMBULATORY OBSERVATION,,2007754572128475909
2714166738054558252,2288881942133868955,38004207,2157-12-31,2157-12-31 16:00:00,2157-12-31,2157-12-31 16:00:00,32817,,,,38004207,,ecgmx_039.3900001.III S DUR,2000001801,,AMBULATORY OBSERVATION,,2007754572128475909
-6459377260302899363,2288881942133868955,38004207,2157-12-31,2157-12-31 21:04:16,2157-12-31,2157-12-31 21:04:16,32817,,,38004207,38004207,-8998976409441800299,ecgmx_039.3900031.GLOBAL QRS Dur,2000001801,AMBULATORY OBSERVATION,AMBULATORY OBSERVATION,,2007754572128475909
2198603538052798695,2288881942133868955,38004207,2157-12-31,2157-12-31 21:04:16,2157-12-31,2157-12-31 21:04:16,32817,,,38004207,38004207,-1046264924347005665,ecgmx_039.3900031.III I AMP,2000001801,AMBULATORY OBSERVATION,AMBULATORY OBSERVATION,,2007754572128475909
1194516527503398019,2288881942133868955,38004207,2157-12-31,2157-12-31 21:04:16,2157-12-31,2157-12-31 21:04:16,32817,,,38004207,38004207,7103188479062239463,ecgmx_039.3900031.III TPOS AMP,2000001801,AMBULATORY OBSERVATION,AMBULATORY OBSERVATION,,2007754572128475909
7439026212079496920,2288881942133868955,38004207,2157-12-31,2157-12-31 21:04:16,2157-12-31,2157-12-31 21:04:16,32817,,,38004207,38004207,-7265914546771747379,ecgmx_039.3900031.III QRS DUR,2000001801,AMBULATORY OBSERVATION,AMBULATORY OBSERVATION,,2007754572128475909
7103188479062239463,2288881942133868955,38004207,2157-12-31,2157-12-31 21:04:16,2157-12-31,2157-12-31 21:04:16,32817,,,38004207,38004207,4208161525998509099,ecgmx_039.3900031.GLOBAL QRS DUR,2000001801,AMBULATORY OBSERVATION,AMBULATORY OBSERVATION,,2007754572128475909
-1046264924347005665,2288881942133868955,38004207,2157-12-31,2157-12-31 21:04:16,2157-12-31,2157-12-31 21:04:16,32817,,,38004207,38004207,929587495090539490,ecgmx_039.3900031.III STJ80,2000001801,AMBULATORY OBSERVATION,AMBULATORY OBSERVATION,,2007754572128475909
-8998976409441800299,2288881942133868955,38004207,2157-12-31,2157-12-31 21:04:16,2157-12-31,2157-12-31 21:04:16,32817,,,38004207,38004207,3222381543152960138,ecgmx_039.3900031.GLOBAL PR INT,2000001801,AMBULATORY OBSERVATION,AMBULATORY OBSERVATION,,2007754572128475909
4208161525998509099,2288881942133868955,38004207,2157-12-31,2157-12-31 21:04:16,2157-12-31,2157-12-31 21:04:16,32817,,,38004207,38004207,2198603538052798695,ecgmx_039.3900031.III R DUR,2000001801,AMBULATORY OBSERVATION,AMBULATORY OBSERVATION,,2007754572128475909
4565578687639563813,2288881942133868955,38004207,2157-12-31,2157-12-31 21:04:16,2157-12-31,2157-12-31 21:04:16,32817,,,38004207,38004207,6369941884623831330,ecgmx_039.3900031.GLOBAL QTc,2000001801,AMBULATORY OBSERVATION,AMBULATORY OBSERVATION,,2007754572128475909
399898261903049879,2288881942133868955,38004207,2157-12-31,2157-12-31 21:04:16,2157-12-31,2157-12-31 21:04:16,32817,,,38004207,38004207,7439026212079496920,ecgmx_039.3900031.III STJ60,2000001801,AMBULATORY OBSERVATION,AMBULATORY OBSERVATION,,2007754572128475909
6369941884623831330,2288881942133868955,38004207,2157-12-31,2157-12-31 21:04:16,2157-12-31,2157-12-31 21:04:16,32817,,,38004207,38004207,1194516527503398019,ecgmx_039.3900031.GLOBAL HEART RATE,2000001801,AMBULATORY OBSERVATION,AMBULATORY OBSERVATION,,2007754572128475909
3222381543152960138,2288881942133868955,38004207,2157-12-31,2157-12-31 21:04:16,2157-12-31,2157-12-31 21:04:16,32817,,,38004207,38004207,6044763091782488246,ecgmx_039.3900031.III R AMP,2000001801,AMBULATORY OBSERVATION,AMBULATORY OBSERVATION,,2007754572128475909
6044763091782488246,2288881942133868955,38004207,2157-12-31,2157-12-31 21:04:16,2157-12-31,2157-12-31 21:04:16,32817,,,38004207,38004207,399898261903049879,ecgmx_039.3900031.GLOBAL QT,2000001801,AMBULATORY OBSERVATION,AMBULATORY OBSERVATION,,2007754572128475909
-7265914546771747379,2288881942133868955,38004207,2157-12-31,2157-12-31 21:04:16,2157-12-31,2157-12-31 21:04:16,32817,,,38004207,38004207,4565578687639563813,ecgmx_039.3900031.III F AMP,2000001801,AMBULATORY OBSERVATION,AMBULATORY OBSERVATION,,2007754572128475909
8072886938917411669,2288881942133868955,38004207,2157-12-31,2157-12-31 22:15:16,2157-12-31,2157-12-31 22:15:16,32817,,,38004207,38004207,5973333751489836934,ecgmx_039.3900038.GLOBAL QTc,2000001801,AMBULATORY OBSERVATION,AMBULATORY OBSERVATION,,2007754572128475909
-4015293180362446081,2288881942133868955,38004207,2157-12-31,2157-12-31 22:15:16,2157-12-31,2157-12-31 22:15:16,32817,,,38004207,38004207,7156522707839953957,ecgmx_039.3900038.GLOBAL PR INT,2000001801,AMBULATORY OBSERVATION,AMBULATORY OBSERVATION,,2007754572128475909
-6962909094068424489,2288881942133868955,38004207,2157-12-31,2157-12-31 22:15:16,2157-12-31,2157-12-31 22:15:16,32817,,,38004207,38004207,-8514825154012882907,ecgmx_039.3900038.GLOBAL QT,2000001801,AMBULATORY OBSERVATION,AMBULATORY OBSERVATION,,2007754572128475909
-5281704877606590869,2288881942133868955,38004207,2157-12-31,2157-12-31 22:15:16,2157-12-31,2157-12-31 22:15:16,32817,,,38004207,38004207,8072886938917411669,ecgmx_039.3900038.III TPOS AMP,2000001801,AMBULATORY OBSERVATION,AMBULATORY OBSERVATION,,2007754572128475909
6567048649127520659,2288881942133868955,38004207,2157-12-31,2157-12-31 22:15:16,2157-12-31,2157-12-31 22:15:16,32817,,,38004207,38004207,6374096196200664356,ecgmx_039.3900038.III I AMP,2000001801,AMBULATORY OBSERVATION,AMBULATORY OBSERVATION,,2007754572128475909
7643003736945409396,2288881942133868955,38004207,2157-12-31,2157-12-31 22:15:16,2157-12-31,2157-12-31 22:15:16,32817,,,38004207,38004207,-6962909094068424489,ecgmx_039.3900038.III R DUR,2000001801,AMBULATORY OBSERVATION,AMBULATORY OBSERVATION,,2007754572128475909
-3996214996442316893,2288881942133868955,38004207,2157-12-31,2157-12-31 22:15:16,2157-12-31,2157-12-31 22:15:16,32817,,,38004207,38004207,-2963862385205756365,ecgmx_039.3900038.III R AMP,2000001801,AMBULATORY OBSERVATION,AMBULATORY OBSERVATION,,2007754572128475909
-8514825154012882907,2288881942133868955,38004207,2157-12-31,2157-12-31 22:15:16,2157-12-31,2157-12-31 22:15:16,32817,,,38004207,38004207,-3996214996442316893,ecgmx_039.3900038.GLOBAL QRS DUR,2000001801,AMBULATORY OBSERVATION,AMBULATORY OBSERVATION,,2007754572128475909
5973333751489836934,2288881942133868955,38004207,2157-12-31,2157-12-31 22:15:16,2157-12-31,2157-12-31 22:15:16,32817,,,38004207,38004207,-4015293180362446081,ecgmx_039.3900038.III QRS DUR,2000001801,AMBULATORY OBSERVATION,AMBULATORY OBSERVATION,,2007754572128475909
672191613111616395,2288881942133868955,38004207,2157-12-31,2157-12-31 22:15:16,2157-12-31,2157-12-31 22:15:16,32817,,,38004207,38004207,-5281704877606590869,ecgmx_039.3900038.III STJ80,2000001801,AMBULATORY OBSERVATION,AMBULATORY OBSERVATION,,2007754572128475909
-8190070816973973882,2288881942133868955,38004207,2157-12-31,2157-12-31 22:15:16,2157-12-31,2157-12-31 22:15:16,32817,,,38004207,38004207,1317200091873819315,ecgmx_039.3900038.GLOBAL QRS Dur,2000001801,AMBULATORY OBSERVATION,AMBULATORY OBSERVATION,,2007754572128475909
-2963862385205756365,2288881942133868955,38004207,2157-12-31,2157-12-31 22:15:16,2157-12-31,2157-12-31 22:15:16,32817,,,38004207,38004207,-8190070816973973882,ecgmx_039.3900038.III F AMP,2000001801,AMBULATORY OBSERVATION,AMBULATORY OBSERVATION,,2007754572128475909
6374096196200664356,2288881942133868955,38004207,2157-12-31,2157-12-31 22:15:16,2157-12-31,2157-12-31 22:15:16,32817,,,38004207,38004207,672191613111616395,ecgmx_039.3900038.GLOBAL HEART RATE,2000001801,AMBULATORY OBSERVATION,AMBULATORY OBSERVATION,,2007754572128475909
1317200091873819315,2288881942133868955,38004207,2157-12-31,2157-12-31 22:15:16,2157-12-31,2157-12-31 22:15:16,32817,,,38004207,38004207,6567048649127520659,ecgmx_039.3900038.III STJ60,2000001801,AMBULATORY OBSERVATION,AMBULATORY OBSERVATION,,2007754572128475909
-4045944369042738924,2288881942133868955,38004207,2157-12-31,2157-12-31 23:26:16,2157-12-31,2157-12-31 23:26:16,32817,,,38004207,38004207,4201470876814534965,ecgmx_039.3900045.III STJ60,2000001801,AMBULATORY OBSERVATION,AMBULATORY OBSERVATION,,2007754572128475909
-1224933123944534999,2288881942133868955,38004207,2157-12-31,2157-12-31 23:26:16,2157-12-31,2157-12-31 23:26:16,32817,,,38004207,38004207,4932514569621464816,ecgmx_039.3900045.GLOBAL QTc,2000001801,AMBULATORY OBSERVATION,AMBULATORY OBSERVATION,,2007754572128475909
457502183924761945,2288881942133868955,38004207,2157-12-31,2157-12-31 23:26:16,2157-12-31,2157-12-31 23:26:16,32817,,,38004207,38004207,-4045944369042738924,ecgmx_039.3900045.III R AMP,2000001801,AMBULATORY OBSERVATION,AMBULATORY OBSERVATION,,2007754572128475909
-6267171112034665575,2288881942133868955,38004207,2157-12-31,2157-12-31 23:26:16,2157-12-31,2157-12-31 23:26:16,32817,,,38004207,38004207,611926569552073322,ecgmx_039.3900045.GLOBAL HEART RATE,2000001801,AMBULATORY OBSERVATION,AMBULATORY OBSERVATION,,2007754572128475909
1990594077010601818,2288881942133868955,38004207,2157-12-31,2157-12-31 23:26:16,2157-12-31,2157-12-31 23:26:16,32817,,,38004207,38004207,-6866483977783473616,ecgmx_039.3900045.GLOBAL QRS DUR,2000001801,AMBULATORY OBSERVATION,AMBULATORY OBSERVATION,,2007754572128475909
-4022924472755326594,2288881942133868955,38004207,2157-12-31,2157-12-31 23:26:16,2157-12-31,2157-12-31 23:26:16,32817,,,38004207,38004207,457502183924761945,ecgmx_039.3900045.III I AMP,2000001801,AMBULATORY OBSERVATION,AMBULATORY OBSERVATION,,2007754572128475909
5018982928812083960,2288881942133868955,38004207,2157-12-31,2157-12-31 23:26:16,2157-12-31,2157-12-31 23:26:16,32817,,,38004207,38004207,9031901118744881628,ecgmx_039.3900045.GLOBAL QRS Dur,2000001801,AMBULATORY OBSERVATION,AMBULATORY OBSERVATION,,2007754572128475909
7231196759594538544,2288881942133868955,38004207,2157-12-31,2157-12-31 23:26:16,2157-12-31,2157-12-31 23:26:16,32817,,,38004207,38004207,5018982928812083960,ecgmx_039.3900045.III F AMP,2000001801,AMBULATORY OBSERVATION,AMBULATORY OBSERVATION,,2007754572128475909
4932514569621464816,2288881942133868955,38004207,2157-12-31,2157-12-31 23:26:16,2157-12-31,2157-12-31 23:26:16,32817,,,38004207,38004207,-7320097791414474692,ecgmx_039.3900045.III QRS DUR,2000001801,AMBULATORY OBSERVATION,AMBULATORY OBSERVATION,,2007754572128475909
-8446213757700871849,2288881942133868955,38004207,2157-12-31,2157-12-31 23:26:16,2157-12-31,2157-12-31 23:26:16,32817,,,38004207,38004207,-1224933123944534999,ecgmx_039.3900045.III R DUR,2000001801,AMBULATORY OBSERVATION,AMBULATORY OBSERVATION,,2007754572128475909
9031901118744881628,2288881942133868955,38004207,2157-12-31,2157-12-31 23:26:16,2157-12-31,2157-12-31 23:26:16,32817,,,38004207,38004207,-8446213757700871849,ecgmx_039.3900045.GLOBAL QT,2000001801,AMBULATORY OBSERVATION,AMBULATORY OBSERVATION,,2007754572128475909
-6866483977783473616,2288881942133868955,38004207,2157-12-31,2157-12-31 23:26:16,2157-12-31,2157-12-31 23:26:16,32817,,,38004207,38004207,-6267171112034665575,ecgmx_039.3900045.III TPOS AMP,2000001801,AMBULATORY OBSERVATION,AMBULATORY OBSERVATION,,2007754572128475909
4201470876814534965,2288881942133868955,38004207,2157-12-31,2157-12-31 23:26:16,2157-12-31,2157-12-31 23:26:16,32817,,,38004207,38004207,1990594077010601818,ecgmx_039.3900045.GLOBAL PR INT,2000001801,AMBULATORY OBSERVATION,AMBULATORY OBSERVATION,,2007754572128475909
-7320097791414474692,2288881942133868955,38004207,2157-12-31,2157-12-31 23:26:16,2157-12-31,2157-12-31 23:26:16,32817,,,38004207,38004207,-4022924472755326594,ecgmx_039.3900045.III STJ80,2000001801,AMBULATORY OBSERVATION,AMBULATORY OBSERVATION,,2007754572128475909
7175432731536695125,2288881942133868955,38004207,2157-12-31,2157-12-31 17:31:16,2157-12-31,2157-12-31 17:31:16,32817,,,38004207,38004207,-8645879745078010769,ecgmx_039.3900010.III I AMP,2000001801,AMBULATORY OBSERVATION,AMBULATORY OBSERVATION,,2007754572128475909
8027328467690415822,2288881942133868955,38004207,2157-12-31,2157-12-31 17:31:16,2157-12-31,2157-12-31 17:31:16,32817,,,38004207,38004207,7515771569573581021,ecgmx_039.3900010.III S AMP,2000001801,AMBULATORY OBSERVATION,AMBULATORY OBSERVATION,,2007754572128475909
6231101925027740076,2288881942133868955,38004207,2157-12-31,2157-12-31 17:31:16,2157-12-31,2157-12-31 17:31:16,32817,,,38004207,38004207,5219133027589983808,ecgmx_039.3900010.III S DUR,2000001801,AMBULATORY OBSERVATION,AMBULATORY OBSERVATION,,2007754572128475909
-635888639741105077,2288881942133868955,38004207,2157-12-31,2157-12-31 17:31:16,2157-12-31,2157-12-31 17:31:16,32817,,,38004207,38004207,8027328467690415822,ecgmx_039.3900010.GLOBAL QRS DUR,2000001801,AMBULATORY OBSERVATION,AMBULATORY OBSERVATION,,2007754572128475909
5219133027589983808,2288881942133868955,38004207,2157-12-31,2157-12-31 17:31:16,2157-12-31,2157-12-31 17:31:16,32817,,,38004207,38004207,-4165061705536885867,ecgmx_039.3900010.GLOBAL PR INT,2000001801,AMBULATORY OBSERVATION,AMBULATORY OBSERVATION,,2007754572128475909
-3767428998981023537,2288881942133868955,38004207,2157-12-31,2157-12-31 17:31:16,2157-12-31,2157-12-31 17:31:16,32817,,,38004207,38004207,4186418880507513494,ecgmx_039.3900010.III STJ80,2000001801,AMBULATORY OBSERVATION,AMBULATORY OBSERVATION,,2007754572128475909
7515771569573581021,2288881942133868955,38004207,2157-12-31,2157-12-31 17:31:16,2157-12-31,2157-12-31 17:31:16,32817,,,38004207,38004207,-1025426712181258125,ecgmx_039.3900010.III R DUR,2000001801,AMBULATORY OBSERVATION,AMBULATORY OBSERVATION,,2007754572128475909